Reaction Details
Target1-acyl-sn-glycerol-3-phosphate acyltransferase beta
LigandBDBM50141279
Substrate/Competitorn/a
Meas. Tech.ChEBML_100169
IC50 35±n/a nM
Citation Gong, BHong, FKohm, CBonham, LKlein, P Synthesis and SAR of 2-arylbenzoxazoles, benzothiazoles and benzimidazoles as inhibitors of lysophosphatidic acid acyltransferase-beta. Bioorg Med Chem Lett14:1455-9 (2004) 
 
1-acyl-sn-glycerol-3-phosphate acyltransferase beta
Name:1-acyl-sn-glycerol-3-phosphate acyltransferase beta
Type:PROTEIN
Mol. Mass.:30924.09
Organism:Homo sapiens (Human)
Description:ChEMBL_321473
Residue:278
BDBM50141279
NameBDBM50141279
Synonyms:CHEMBL32894 | [4-Chloro-3-(5-chloro-benzooxazol-2-yl)-phenyl]-carbamic acid prop-2-ynyl ester
TypeSmall organic molecule
Emp. Form.C17H10Cl2N2O3
Mol. Mass.361.179
SMILESClc1ccc2oc(nc2c1)-c1cc(NC(=O)OCC#C)ccc1Cl