Reaction Details
Target1-acyl-sn-glycerol-3-phosphate acyltransferase beta
LigandBDBM50141290
Substrate/Competitorn/a
Meas. Tech.ChEBML_100169
IC50 120±n/a nM
Citation Gong, BHong, FKohm, CBonham, LKlein, P Synthesis and SAR of 2-arylbenzoxazoles, benzothiazoles and benzimidazoles as inhibitors of lysophosphatidic acid acyltransferase-beta. Bioorg Med Chem Lett14:1455-9 (2004) 
 
1-acyl-sn-glycerol-3-phosphate acyltransferase beta
Name:1-acyl-sn-glycerol-3-phosphate acyltransferase beta
Type:PROTEIN
Mol. Mass.:30924.09
Organism:Homo sapiens (Human)
Description:ChEMBL_321473
Residue:278
BDBM50141290
NameBDBM50141290
Synonyms:CHEMBL34938 | [4-Chloro-3-(1-methyl-5-trifluoromethyl-1H-benzoimidazol-2-yl)-phenyl]-carbamic acid prop-2-ynyl ester
TypeSmall organic molecule
Emp. Form.C19H13ClF3N3O2
Mol. Mass.407.774
SMILESCn1c(nc2cc(ccc12)C(F)(F)F)-c1cc(NC(=O)OCC#C)ccc1Cl