Reaction Details
Target1-acyl-sn-glycerol-3-phosphate acyltransferase beta
LigandBDBM50141306
Substrate/Competitorn/a
Meas. Tech.ChEBML_100169
IC50 15±n/a nM
Citation Gong, BHong, FKohm, CBonham, LKlein, P Synthesis and SAR of 2-arylbenzoxazoles, benzothiazoles and benzimidazoles as inhibitors of lysophosphatidic acid acyltransferase-beta. Bioorg Med Chem Lett14:1455-9 (2004) 
 
1-acyl-sn-glycerol-3-phosphate acyltransferase beta
Name:1-acyl-sn-glycerol-3-phosphate acyltransferase beta
Type:PROTEIN
Mol. Mass.:30924.09
Organism:Homo sapiens (Human)
Description:ChEMBL_321473
Residue:278
BDBM50141306
NameBDBM50141306
Synonyms:CHEMBL286394 | N-[4-Chloro-3-(5-chloro-benzothiazol-2-yl)-phenyl]-2-cyano-acetamide
TypeSmall organic molecule
Emp. Form.C16H9Cl2N3OS
Mol. Mass.362.233
SMILESClc1ccc2sc(nc2c1)-c1cc(NC(=O)CC#N)ccc1Cl