Reaction Details
TargetIntegrin alpha-V/beta-3
LigandBDBM50141335
Substrate/Competitorn/a
Meas. Tech.ChEMBL_32660 (CHEMBL642828)
IC50 0.530000±n/a nM
Citation Penning, TDRussell, MAChen, BBChen, HYDesai, BNDocter, SHEdwards, DJGesicki, GJLiang, CDMalecha, JWYu, SSEngleman, VWFreeman, SKHanneke, MLShannon, KEWestlin, MMNickols, GA Synthesis of cinnamic acids and related isosteres as potent and selective alpha v beta 3 receptor antagonists. Bioorg Med Chem Lett14:1471-6 (2004) 
 
Integrin alpha-V/beta-3
Name:Integrin alpha-V/beta-3
Type:Enzyme
Mol. Mass.:n/a
Description:n/a
Components:This complex has 2 components.
Component 1
Name:Integrin alpha-V
Synonyms:ITAV_HUMAN Integrin alpha-V/alpha-5 VNRA Vitronectin receptor | Vitronectin receptor subunit alpha
Type:PROTEIN
Mol. Mass.:116024.92
Organism:Homo sapiens (Human)
Description:ChEMBL_582336
Residue:1048
Component 2
Name:Integrin beta-3
Synonyms:CD_antigen=CD61 GPIIIa ITGB3 Platelet membrane glycoprotein IIIa
Type:Protein
Mol. Mass.:87038.91
Organism:Homo sapiens (Human)
Description:P05106
Residue:788
BDBM50141335
NameBDBM50141335
Synonyms:3-{3-Ethyl-4-[3-(1,4,5,6-tetrahydro-pyrimidin-2-ylamino)-benzoylamino]-phenyl}-acrylic acid | CHEMBL34993
TypeSmall organic molecule
Emp. Form.C22H24N4O3
Mol. Mass.392.451
SMILESCCc1cc(C=CC(O)=O)ccc1NC(=O)c1cccc(NC2=NCCCN2)c1