Reaction Details
TargetIntegrin alpha-V/beta-1
LigandBDBM50141329
Substrate/Competitorn/a
Meas. Tech.ChEMBL_32649 (CHEMBL642144)
IC50 10±n/a nM
Citation Penning, TDRussell, MAChen, BBChen, HYDesai, BNDocter, SHEdwards, DJGesicki, GJLiang, CDMalecha, JWYu, SSEngleman, VWFreeman, SKHanneke, MLShannon, KEWestlin, MMNickols, GA Synthesis of cinnamic acids and related isosteres as potent and selective alpha v beta 3 receptor antagonists. Bioorg Med Chem Lett14:1471-6 (2004) 
 
Integrin alpha-V/beta-1
Name:Integrin alpha-V/beta-1
Type:Enzyme
Mol. Mass.:n/a
Description:n/a
Components:This complex has 2 components.
Component 1
Name:Integrin alpha-V
Synonyms:ITAV_HUMAN Integrin alpha-V/alpha-5 VNRA Vitronectin receptor | Vitronectin receptor subunit alpha
Type:PROTEIN
Mol. Mass.:116024.92
Organism:Homo sapiens (Human)
Description:ChEMBL_582336
Residue:1048
Component 2
Name:Integrin beta-1
Synonyms:CD_antigen=CD29 Fibronectin receptor beta GPIIA ITGB1 MDF2 | MSK12
Type:Enzyme
Mol. Mass.:88400.38
Organism:Homo sapiens (Human)
Description:P05556
Residue:798
BDBM50141329
NameBDBM50141329
Synonyms:2-Benzenesulfonylamino-3-{4-[3-(1,4,5,6-tetrahydro-pyrimidin-2-ylamino)-benzoylamino]-phenyl}-propionic acid | CHEMBL37906
TypeSmall organic molecule
Emp. Form.C26H27N5O5S
Mol. Mass.521.588
SMILESOC(=O)C(Cc1ccc(NC(=O)c2cccc(NC3=NCCCN3)c2)cc1)NS(=O)(=O)c1ccccc1