Reaction Details
TargetIntegrin alpha-IIb/beta-3
LigandBDBM50141324
Substrate/Competitorn/a
Meas. Tech.ChEMBL_215972 (CHEMBL821001)
IC50 1000±n/a nM
Citation Penning, TDRussell, MAChen, BBChen, HYDesai, BNDocter, SHEdwards, DJGesicki, GJLiang, CDMalecha, JWYu, SSEngleman, VWFreeman, SKHanneke, MLShannon, KEWestlin, MMNickols, GA Synthesis of cinnamic acids and related isosteres as potent and selective alpha v beta 3 receptor antagonists. Bioorg Med Chem Lett14:1471-6 (2004) 
 
Integrin alpha-IIb/beta-3
Name:Integrin alpha-IIb/beta-3
Synonyms:Glycoprotein IIb/IIIa
Type:n/a
Mol. Mass.:n/a
Description:ASSAY_ID of EBI is 30109
Components:This complex has 2 components.
Component 1
Name:Integrin beta-3
Type:Protein
Mol. Mass.:87038.91
Organism:Homo sapiens (Human)
Description:P05106
Residue:788
Component 2
Name:Integrin alpha-IIb
Synonyms:CD_antigen=CD41 GPIIb Glycoprotein IIb ITGA2B Integrin alpha-IIb heavy chain Integrin alpha-IIb light chain, form 2 Integrin alpha-V/beta-3 and alpha-IIb/beta 3 | Platelet membrane glycoprotein IIb
Type:Protein
Mol. Mass.:113354.85
Organism:Homo sapiens (Human)
Description:P08514
Residue:1039
BDBM50141324
NameBDBM50141324
Synonyms:2-Isopropoxycarbonylamino-3-{2-methoxy-4-[3-(1,4,5,6-tetrahydro-pyrimidin-2-ylamino)-benzoylamino]-phenyl}-propionic acid | CHEMBL35360
TypeSmall organic molecule
Emp. Form.C25H31N5O6
Mol. Mass.497.5435
SMILESCOc1cc(NC(=O)c2cccc(NC3=NCCCN3)c2)ccc1CC(NC(=O)OC(C)C)C(O)=O