Reaction Details
TargetTumor necrosis factor receptor superfamily member 1A
LigandBDBM50141487
Substrate/Competitorn/a
Meas. Tech.ChEBML_224214
IC50 2000±n/a nM
Citation Meng, CQZheng, XSNi, LYe, ZSimpson, JEWorsencroft, KJHotema, MRWeingarten, MDSkudlarek, JWGilmore, JMHoong, LKHill, RRMarino, EMSuen, KLKunsch, CWasserman, MASikorski, JA Discovery of novel heteroaryl-substituted chalcones as inhibitors of TNF-alpha-induced VCAM-1 expression. Bioorg Med Chem Lett14:1513-7 (2004) 
 
Tumor necrosis factor receptor superfamily member 1A
Name:Tumor necrosis factor receptor superfamily member 1A
Type:PROTEIN
Mol. Mass.:50495.39
Organism:Homo sapiens (Human)
Description:ChEMBL_1509419
Residue:455
BDBM50141487
NameBDBM50141487
Synonyms:(E)-3-(3-Bromo-4,5-dimethoxy-phenyl)-1-(2,4,5-trimethoxy-phenyl)-propenone | CHEMBL405035
TypeSmall organic molecule
Emp. Form.C20H21BrO6
Mol. Mass.437.281
SMILESCOc1cc(OC)c(cc1OC)C(=O)\C=C\c1cc(Br)c(OC)c(OC)c1