Reaction Details
TargetProstaglandin G/H synthase 2
LigandBDBM50452027
Substrate/Competitorn/a
Meas. Tech.ChEBML_157993
IC50 179700±n/a nM
Citation Mittal, SMalde, ASelvam, CArun, KHJohar, PSJachak, SMRamarao, PBharatam, PVChawla, HP Synthesis and evaluation of S-4-(3-thienyl)phenyl-alpha-methylacetic acid. Bioorg Med Chem Lett14:979-82 (2004) 
 
Prostaglandin G/H synthase 2
Name:Prostaglandin G/H synthase 2
Type:Protein
Mol. Mass.:68976.98
Organism:Ovis aries (Sheep)
Description:n/a
Residue:603
BDBM50452027
NameBDBM50452027
Synonyms:CHEMBL2096754
TypeSmall organic molecule
Emp. Form.C13H12O2S
Mol. Mass.232.298
SMILESC[C@H](C(O)=O)c1ccc(cc1)-c1ccsc1