Reaction Details
TargetProstaglandin G/H synthase 1
LigandBDBM50169047
Substrate/Competitorn/a
Meas. Tech.ChEBML_159397
IC50 2260±n/a nM
Citation Mittal, SMalde, ASelvam, CArun, KHJohar, PSJachak, SMRamarao, PBharatam, PVChawla, HP Synthesis and evaluation of S-4-(3-thienyl)phenyl-alpha-methylacetic acid. Bioorg Med Chem Lett14:979-82 (2004) 
 
Prostaglandin G/H synthase 1
Name:Prostaglandin G/H synthase 1
Type:Protein
Mol. Mass.:68868.60
Organism:Ovis aries (Sheep)
Description:n/a
Residue:600
BDBM50169047
NameBDBM50169047
Synonyms:(S)-2-(4-Isobutyl-phenyl)-propionic acid (S)-ibuprofen DEXIBUPROFEN | IBUPROFEN LYSINE
TypeSmall organic molecule
Emp. Form.C13H18O2
Mol. Mass.206.2808
SMILESCC(C)Cc1ccc(cc1)[C@H](C)C(O)=O