Reaction Details
TargetCoagulation factor X
LigandBDBM50142126
Substrate/Competitorn/a
Meas. Tech.ChEMBL_49139 (CHEMBL661985)
Ki 0.300000±n/a nM
Citation Zhang, PBao, LZuckett, JFGoldman, EAJia, ZJArfsten, AEdwards, SSinha, UHutchaleelaha, APark, GLambing, JLHollenbach, SJScarborough, RMZhu, BY Design, synthesis, and SAR of anthranilamide-based factor Xa inhibitors incorporating substituted biphenyl P4 motifs. Bioorg Med Chem Lett14:983-7 (2004) 
 
Coagulation factor X
Name:Coagulation factor X
Type:Enzyme
Mol. Mass.:54726.60
Organism:Homo sapiens (Human)
Description:n/a
Residue:488
BDBM50142126
NameBDBM50142126
Synonyms:2'-Guanidinomethyl-biphenyl-4-carboxylic acid [4-chloro-2-(5-chloro-pyridin-2-ylcarbamoyl)-phenyl]-amide | CHEMBL173878
TypeSmall organic molecule
Emp. Form.C27H22Cl2N6O2
Mol. Mass.533.409
SMILES[#7]\[#6](-[#7])=[#7]\[#6]-c1ccccc1-c1ccc(cc1)-[#6](=O)-[#7]-c1ccc(Cl)cc1-[#6](=O)-[#7]-c1ccc(Cl)cn1