Reaction Details
TargetCoagulation factor X
LigandBDBM50142094
Substrate/Competitorn/a
Meas. Tech.ChEMBL_49138 (CHEMBL661984)
IC50 5.6±n/a nM
Citation Zhang, PBao, LZuckett, JFGoldman, EAJia, ZJArfsten, AEdwards, SSinha, UHutchaleelaha, APark, GLambing, JLHollenbach, SJScarborough, RMZhu, BY Design, synthesis, and SAR of anthranilamide-based factor Xa inhibitors incorporating substituted biphenyl P4 motifs. Bioorg Med Chem Lett14:983-7 (2004) 
 
Coagulation factor X
Name:Coagulation factor X
Type:Enzyme
Mol. Mass.:54726.60
Organism:Homo sapiens (Human)
Description:n/a
Residue:488
BDBM50142094
NameBDBM50142094
Synonyms:2'-[1,4]Diazepan-1-yl-biphenyl-4-carboxylic acid [4-chloro-2-(5-chloro-pyridin-2-ylcarbamoyl)-phenyl]-amide | CHEMBL368544
TypeSmall organic molecule
Emp. Form.C30H27Cl2N5O2
Mol. Mass.560.474
SMILESClc1ccc(NC(=O)c2cc(Cl)ccc2NC(=O)c2ccc(cc2)-c2ccccc2N2CCCNCC2)nc1