Reaction Details
TargetCoagulation factor X
LigandBDBM50142121
Substrate/Competitorn/a
Meas. Tech.ChEBML_49138
IC50 1.8±n/a nM
Citation Zhang, PBao, LZuckett, JFGoldman, EAJia, ZJArfsten, AEdwards, SSinha, UHutchaleelaha, APark, GLambing, JLHollenbach, SJScarborough, RMZhu, BY Design, synthesis, and SAR of anthranilamide-based factor Xa inhibitors incorporating substituted biphenyl P4 motifs. Bioorg Med Chem Lett14:983-7 (2004) 
 
Coagulation factor X
Name:Coagulation factor X
Type:Enzyme
Mol. Mass.:54726.60
Organism:Homo sapiens (Human)
Description:n/a
Residue:488
BDBM50142121
NameBDBM50142121
Synonyms:1-{4'-[4-Chloro-2-(5-chloro-pyridin-2-ylcarbamoyl)-phenylcarbamoyl]-biphenyl-3-yl}-piperidine-4-carboxylic acid | CHEMBL367386
TypeSmall organic molecule
Emp. Form.C31H26Cl2N4O4
Mol. Mass.589.469
SMILESOC(=O)C1CCN(CC1)c1cccc(c1)-c1ccc(cc1)C(=O)Nc1ccc(Cl)cc1C(=O)Nc1ccc(Cl)cn1