Reaction Details
TargetCoagulation factor X
LigandBDBM50114455
Substrate/Competitorn/a
Meas. Tech.ChEBML_49138
IC50 7.5±n/a nM
Citation Zhang, PBao, LZuckett, JFGoldman, EAJia, ZJArfsten, AEdwards, SSinha, UHutchaleelaha, APark, GLambing, JLHollenbach, SJScarborough, RMZhu, BY Design, synthesis, and SAR of anthranilamide-based factor Xa inhibitors incorporating substituted biphenyl P4 motifs. Bioorg Med Chem Lett14:983-7 (2004) 
 
Coagulation factor X
Name:Coagulation factor X
Type:Enzyme
Mol. Mass.:54726.60
Organism:Homo sapiens (Human)
Description:n/a
Residue:488
BDBM50114455
NameBDBM50114455
Synonyms:2'-Sulfamoyl-biphenyl-4-carboxylic acid [2-(3-carbamimidoyl-phenoxy)-ethyl]-amide | CHEMBL432306
TypeSmall organic molecule
Emp. Form.C22H22N4O4S
Mol. Mass.438.499
SMILESNC(=N)c1cccc(OCCNC(=O)c2ccc(cc2)-c2ccccc2S(N)(=O)=O)c1