Reaction Details
TargetCoagulation factor X
LigandBDBM50142154
Substrate/Competitorn/a
Meas. Tech.ChEMBL_48808 (CHEMBL872477)
Ki 1±n/a nM
Citation Zhang, PBao, LZuckett, JFJia, ZJWoolfrey, JArfsten, AEdwards, SSinha, UHutchaleelaha, ALambing, JLHollenbach, SJScarborough, RMZhu, BY Design, synthesis, and SAR of anthranilamide-based factor Xa inhibitors with improved functional activity. Bioorg Med Chem Lett14:989-93 (2004) 
 
Coagulation factor X
Name:Coagulation factor X
Type:Enzyme
Mol. Mass.:54726.60
Organism:Homo sapiens (Human)
Description:n/a
Residue:488
BDBM50142154
NameBDBM50142154
Synonyms:CHEMBL174499 | {4-[4-Chloro-2-(5-chloro-pyridin-2-ylcarbamoyl)-phenylcarbamoyl]-benzyl}-trimethyl-ammonium
TypeSmall organic molecule
Emp. Form.C23H23Cl2N4O2
Mol. Mass.458.36
SMILESC[N+](C)(C)Cc1ccc(cc1)C(=O)Nc1ccc(Cl)cc1C(=O)Nc1ccc(Cl)cn1