Reaction Details
TargetCoagulation factor X
LigandBDBM50142142
Substrate/Competitorn/a
Meas. Tech.ChEMBL_48817 (CHEMBL661218)
Ki 0.300000±n/a nM
Citation Zhang, PBao, LZuckett, JFJia, ZJWoolfrey, JArfsten, AEdwards, SSinha, UHutchaleelaha, ALambing, JLHollenbach, SJScarborough, RMZhu, BY Design, synthesis, and SAR of anthranilamide-based factor Xa inhibitors with improved functional activity. Bioorg Med Chem Lett14:989-93 (2004) 
 
Coagulation factor X
Name:Coagulation factor X
Type:Enzyme
Mol. Mass.:54726.60
Organism:Homo sapiens (Human)
Description:n/a
Residue:488
BDBM50142142
NameBDBM50142142
Synonyms:5-Chloro-N-(5-chloro-pyridin-2-yl)-2-[4-(N',N'-dimethyl-hydrazinomethyl)-benzoylamino]-benzamide | CHEMBL176671
TypeSmall organic molecule
Emp. Form.C22H21Cl2N5O2
Mol. Mass.458.34
SMILESCN(C)NCc1ccc(cc1)C(=O)Nc1ccc(Cl)cc1C(=O)Nc1ccc(Cl)cn1