Reaction Details
TargetPlasma kallikrein
LigandBDBM50142139
Substrate/Competitorn/a
Meas. Tech.ChEBML_92366
IC50 380±n/a nM
Citation Zhang, PBao, LZuckett, JFJia, ZJWoolfrey, JArfsten, AEdwards, SSinha, UHutchaleelaha, ALambing, JLHollenbach, SJScarborough, RMZhu, BY Design, synthesis, and SAR of anthranilamide-based factor Xa inhibitors with improved functional activity. Bioorg Med Chem Lett14:989-93 (2004) 
 
Plasma kallikrein
Name:Plasma kallikrein
Type:Protein
Mol. Mass.:71391.16
Organism:Homo sapiens (Human)
Description:P03952
Residue:638
BDBM50142139
NameBDBM50142139
Synonyms:5-Chloro-N-(5-chloro-pyridin-2-yl)-2-{4-[(N-methyl-guanidino)-methyl]-benzoylamino}-benzamide | CHEMBL174558
TypeSmall organic molecule
Emp. Form.C22H20Cl2N6O2
Mol. Mass.471.339
SMILESCN(Cc1ccc(cc1)C(=O)Nc1ccc(Cl)cc1C(=O)Nc1ccc(Cl)cn1)C(N)=N