Reaction Details
TargetVitamin K-dependent protein C
LigandBDBM50142161
Substrate/Competitorn/a
Meas. Tech.ChEBML_27850
IC50>11000±n/a nM
Citation Zhang, PBao, LZuckett, JFJia, ZJWoolfrey, JArfsten, AEdwards, SSinha, UHutchaleelaha, ALambing, JLHollenbach, SJScarborough, RMZhu, BY Design, synthesis, and SAR of anthranilamide-based factor Xa inhibitors with improved functional activity. Bioorg Med Chem Lett14:989-93 (2004) 
 
Vitamin K-dependent protein C
Name:Vitamin K-dependent protein C
Type:Enzyme
Mol. Mass.:52067.73
Organism:Homo sapiens (Human)
Description:n/a
Residue:461
BDBM50142161
NameBDBM50142161
Synonyms:5-Chloro-N-(5-chloro-pyridin-2-yl)-2-(4-{[methyl-(1-methyl-4,5-dihydro-1H-imidazol-2-yl)-amino]-methyl}-benzoylamino)-benzamide | CHEMBL175130
TypeSmall organic molecule
Emp. Form.C25H24Cl2N6O2
Mol. Mass.511.403
SMILESCN(Cc1ccc(cc1)C(=O)Nc1ccc(Cl)cc1C(=O)Nc1ccc(Cl)cn1)C1=NCCN1C