Reaction Details
TargetCoagulation factor X
LigandBDBM50142168
Substrate/Competitorn/a
Meas. Tech.ChEBML_48817
IC50 35±n/a nM
Citation Zhang, PBao, LZuckett, JFJia, ZJWoolfrey, JArfsten, AEdwards, SSinha, UHutchaleelaha, ALambing, JLHollenbach, SJScarborough, RMZhu, BY Design, synthesis, and SAR of anthranilamide-based factor Xa inhibitors with improved functional activity. Bioorg Med Chem Lett14:989-93 (2004) 
 
Coagulation factor X
Name:Coagulation factor X
Type:Enzyme
Mol. Mass.:54726.60
Organism:Homo sapiens (Human)
Description:n/a
Residue:488
BDBM50142168
NameBDBM50142168
Synonyms:5-Chloro-N-(5-chloro-pyridin-2-yl)-2-(4-diethylaminomethyl-benzoylamino)-benzamide | CHEMBL174870
TypeSmall organic molecule
Emp. Form.C24H24Cl2N4O2
Mol. Mass.471.379
SMILESCCN(CC)Cc1ccc(cc1)C(=O)Nc1ccc(Cl)cc1C(=O)Nc1ccc(Cl)cn1