Reaction Details
TargetCoagulation factor X
LigandBDBM50142179
Substrate/Competitorn/a
Meas. Tech.ChEBML_48817
IC50 3.6±n/a nM
Citation Zhang, PBao, LZuckett, JFJia, ZJWoolfrey, JArfsten, AEdwards, SSinha, UHutchaleelaha, ALambing, JLHollenbach, SJScarborough, RMZhu, BY Design, synthesis, and SAR of anthranilamide-based factor Xa inhibitors with improved functional activity. Bioorg Med Chem Lett14:989-93 (2004) 
 
Coagulation factor X
Name:Coagulation factor X
Type:Enzyme
Mol. Mass.:54726.60
Organism:Homo sapiens (Human)
Description:n/a
Residue:488
BDBM50142179
NameBDBM50142179
Synonyms:2-[4-(Acetimidoylamino-methyl)-benzoylamino]-5-chloro-N-(5-chloro-pyridin-2-yl)-benzamide | CHEMBL369015
TypeSmall organic molecule
Emp. Form.C22H19Cl2N5O2
Mol. Mass.456.325
SMILESCC(=N)NCc1ccc(cc1)C(=O)Nc1ccc(Cl)cc1C(=O)Nc1ccc(Cl)cn1