Reaction Details
TargetCoagulation factor X
LigandBDBM50142138
Substrate/Competitorn/a
Meas. Tech.ChEBML_48817
IC50 1.5±n/a nM
Citation Zhang, PBao, LZuckett, JFJia, ZJWoolfrey, JArfsten, AEdwards, SSinha, UHutchaleelaha, ALambing, JLHollenbach, SJScarborough, RMZhu, BY Design, synthesis, and SAR of anthranilamide-based factor Xa inhibitors with improved functional activity. Bioorg Med Chem Lett14:989-93 (2004) 
 
Coagulation factor X
Name:Coagulation factor X
Type:Enzyme
Mol. Mass.:54726.60
Organism:Homo sapiens (Human)
Description:n/a
Residue:488
BDBM50142138
NameBDBM50142138
Synonyms:5-Chloro-N-(5-chloro-pyridin-2-yl)-2-(4-{[(4,5-dihydro-oxazol-2-yl)-methyl-amino]-methyl}-benzoylamino)-benzamide | CHEMBL366358
TypeSmall organic molecule
Emp. Form.C24H21Cl2N5O3
Mol. Mass.498.361
SMILESCN(Cc1ccc(cc1)C(=O)Nc1ccc(Cl)cc1C(=O)Nc1ccc(Cl)cn1)C1=NCCO1