Reaction Details
TargetSerine protease 1
LigandBDBM50142139
Substrate/Competitorn/a
Meas. Tech.ChEBML_212711
IC50>11000±n/a nM
Citation Zhang, PBao, LZuckett, JFJia, ZJWoolfrey, JArfsten, AEdwards, SSinha, UHutchaleelaha, ALambing, JLHollenbach, SJScarborough, RMZhu, BY Design, synthesis, and SAR of anthranilamide-based factor Xa inhibitors with improved functional activity. Bioorg Med Chem Lett14:989-93 (2004) 
 
Serine protease 1
Name:Serine protease 1
Type:Enzyme
Mol. Mass.:26557.80
Organism:Homo sapiens (Human)
Description:P07477
Residue:247
BDBM50142139
NameBDBM50142139
Synonyms:5-Chloro-N-(5-chloro-pyridin-2-yl)-2-{4-[(N-methyl-guanidino)-methyl]-benzoylamino}-benzamide | CHEMBL174558
TypeSmall organic molecule
Emp. Form.C22H20Cl2N6O2
Mol. Mass.471.339
SMILESCN(Cc1ccc(cc1)C(=O)Nc1ccc(Cl)cc1C(=O)Nc1ccc(Cl)cn1)C(N)=N