Reaction Details
TargetPlasminogen
LigandBDBM50142169
Substrate/Competitorn/a
Meas. Tech.ChEBML_155053
IC50>11000±n/a nM
Citation Zhang, PBao, LZuckett, JFJia, ZJWoolfrey, JArfsten, AEdwards, SSinha, UHutchaleelaha, ALambing, JLHollenbach, SJScarborough, RMZhu, BY Design, synthesis, and SAR of anthranilamide-based factor Xa inhibitors with improved functional activity. Bioorg Med Chem Lett14:989-93 (2004) 
 
Plasminogen
Name:Plasminogen
Type:Enzyme
Mol. Mass.:90579.18
Organism:Homo sapiens (Human)
Description:n/a
Residue:810
BDBM50142169
NameBDBM50142169
Synonyms:5-Chloro-N-(5-chloro-pyridin-2-yl)-2-[4-(N,N'-dimethyl-guanidinomethyl)-benzoylamino]-benzamide | CHEMBL369681
TypeSmall organic molecule
Emp. Form.C23H22Cl2N6O2
Mol. Mass.485.366
SMILESCNC(=N)N(C)Cc1ccc(cc1)C(=O)Nc1ccc(Cl)cc1C(=O)Nc1ccc(Cl)cn1