Reaction Details
TargetVitamin K-dependent protein C
LigandBDBM50142152
Substrate/Competitorn/a
Meas. Tech.ChEBML_27850
IC50>11000±n/a nM
Citation Zhang, PBao, LZuckett, JFJia, ZJWoolfrey, JArfsten, AEdwards, SSinha, UHutchaleelaha, ALambing, JLHollenbach, SJScarborough, RMZhu, BY Design, synthesis, and SAR of anthranilamide-based factor Xa inhibitors with improved functional activity. Bioorg Med Chem Lett14:989-93 (2004) 
 
Vitamin K-dependent protein C
Name:Vitamin K-dependent protein C
Type:Enzyme
Mol. Mass.:52067.73
Organism:Homo sapiens (Human)
Description:n/a
Residue:461
BDBM50142152
NameBDBM50142152
Synonyms:5-Chloro-N-(5-chloro-pyridin-2-yl)-2-(4-piperidin-1-ylmethyl-benzoylamino)-benzamide | CHEMBL368614
TypeSmall organic molecule
Emp. Form.C25H24Cl2N4O2
Mol. Mass.483.39
SMILESClc1ccc(NC(=O)c2cc(Cl)ccc2NC(=O)c2ccc(CN3CCCCC3)cc2)nc1