Reaction Details
TargetCoagulation factor X
LigandBDBM50142141
Substrate/Competitorn/a
Meas. Tech.ChEBML_48817
IC50 10±n/a nM
Citation Zhang, PBao, LZuckett, JFJia, ZJWoolfrey, JArfsten, AEdwards, SSinha, UHutchaleelaha, ALambing, JLHollenbach, SJScarborough, RMZhu, BY Design, synthesis, and SAR of anthranilamide-based factor Xa inhibitors with improved functional activity. Bioorg Med Chem Lett14:989-93 (2004) 
 
Coagulation factor X
Name:Coagulation factor X
Type:Enzyme
Mol. Mass.:54726.60
Organism:Homo sapiens (Human)
Description:n/a
Residue:488
BDBM50142141
NameBDBM50142141
Synonyms:5-Chloro-N-(5-chloro-pyridin-2-yl)-2-(4-{[(4,5-dihydro-thiazol-2-yl)-methyl-amino]-methyl}-benzoylamino)-benzamide | CHEMBL176757
TypeSmall organic molecule
Emp. Form.C24H21Cl2N5O2S
Mol. Mass.514.427
SMILESCN(Cc1ccc(cc1)C(=O)Nc1ccc(Cl)cc1C(=O)Nc1ccc(Cl)cn1)C1=NCCS1