Reaction Details
TargetMelatonin receptor type 1B
LigandBDBM50142226
Substrate/Competitorn/a
Meas. Tech.ChEBML_105277
Ki 5.9±n/a nM
Citation Epperson, JRDeskus, JAGentile, AJIben, LGRyan, ESarbin, NS 4-Substituted anilides as selective melatonin MT2 receptor agonists. Bioorg Med Chem Lett14:1023-6 (2004) 
 
Melatonin receptor type 1B
Name:Melatonin receptor type 1B
Type:Enzyme
Mol. Mass.:40203.54
Organism:Homo sapiens (Human)
Description:P49286
Residue:362
BDBM50142226
NameBDBM50142226
Synonyms:2-Methoxy-N-[4-(3-methoxy-phenoxy)-phenyl]-acetamide | CHEMBL7659
TypeSmall organic molecule
Emp. Form.C16H17NO4
Mol. Mass.287.3105
SMILESCOCC(=O)Nc1ccc(Oc2cccc(OC)c2)cc1