Reaction Details
TargetDNA topoisomerase 1
LigandBDBM50142529
Substrate/Competitorn/a
Meas. Tech.ChEBML_54043
IC50 4700±n/a nM
Citation Abdel-Aziz, MMatsuda, KOtsuka, MUyeda, MOkawara, TSuzuki, K Inhibitory activities against topoisomerase I and II by polyhydroxybenzoyl amide derivatives and their structure-activity relationship. Bioorg Med Chem Lett14:1669-72 (2004) 
 
DNA topoisomerase 1
Name:DNA topoisomerase 1
Type:Enzyme
Mol. Mass.:90771.02
Organism:Homo sapiens (Human)
Description:P11387
Residue:765
BDBM50142529
NameBDBM50142529
Synonyms:Acetic acid 2,3-diacetoxy-5-[2-(3,4,5-triacetoxy-benzoylamino)-phenylcarbamoyl]-phenyl ester | CHEMBL46853
TypeSmall organic molecule
Emp. Form.C32H28N2O14
Mol. Mass.664.5697
SMILESCC(=O)Oc1cc(cc(OC(C)=O)c1OC(C)=O)C(=O)Nc1ccccc1NC(=O)c1cc(OC(C)=O)c(OC(C)=O)c(OC(C)=O)c1