Reaction Details
TargetCalcitonin gene-related peptide type 1 receptor
LigandBDBM50576175
Substrate/Competitorn/a
Meas. Tech.ChEMBL_2126599 (CHEMBL4835944)
Ki 0.014000±n/a nM
Citation Luo, GJiang, XJChen, LConway, CMGulianello, MKostich, WKeavy, DSignor, LJChen, PDavis, CWhiterock, VJSchartman, RWidmann, KAMacor, JEDubowchik, GM Calcitonin gene-related peptide (CGRP) receptor antagonists: Heterocyclic modification of a novel azepinone lead. Bioorg Med Chem Lett43:0 (2021) 
 
Calcitonin gene-related peptide type 1 receptor
Name:Calcitonin gene-related peptide type 1 receptor
Type:Enzyme Catalytic Domain
Mol. Mass.:52980.45
Organism:Homo sapiens (Human)
Description:Q16602
Residue:461
BDBM50576175
NameBDBM50576175
Synonyms:CHEMBL4859941
TypeSmall organic molecule
Emp. Form.C31H34ClF3N6O4
Mol. Mass.647.088
SMILESCCn1c2c3CN(CC(F)(F)F)C(=O)[C@H](CC(=O)N4CCC(CC4)N4CCc5ccccc5NC4=O)Cc3cc(Cl)c2[nH]c1=O