Reaction Details
TargetCalcitonin gene-related peptide type 1 receptor
LigandBDBM50576177
Substrate/Competitorn/a
Meas. Tech.ChEMBL_2126599 (CHEMBL4835944)
Ki 0.026000±n/a nM
Citation Luo, GJiang, XJChen, LConway, CMGulianello, MKostich, WKeavy, DSignor, LJChen, PDavis, CWhiterock, VJSchartman, RWidmann, KAMacor, JEDubowchik, GM Calcitonin gene-related peptide (CGRP) receptor antagonists: Heterocyclic modification of a novel azepinone lead. Bioorg Med Chem Lett43:0 (2021) 
 
Calcitonin gene-related peptide type 1 receptor
Name:Calcitonin gene-related peptide type 1 receptor
Type:Enzyme Catalytic Domain
Mol. Mass.:52980.45
Organism:Homo sapiens (Human)
Description:Q16602
Residue:461
BDBM50576177
NameBDBM50576177
Synonyms:CHEMBL4875327
TypeSmall organic molecule
Emp. Form.C28H26ClF6N7O4
Mol. Mass.673.994
SMILESFC(F)(F)CN1Cc2c(C[C@@H](CC(=O)N3CCC(CC3)n3c4cccnc4[nH]c3=O)C1=O)cc(Cl)c1[nH]c(=O)n(CC(F)(F)F)c21