Reaction Details
TargetGABA-A receptor; alpha-5/beta-3/gamma-2
LigandBDBM50143117
Substrate/Competitorn/a
Meas. Tech.ChEMBL_69797 (CHEMBL678745)
Ki 3.2±n/a nM
Citation Carling, RWMoore, KWStreet, LJWild, DIsted, CLeeson, PDThomas, SO'Connor, DMcKernan, RMQuirk, KCook, SMAtack, JRWafford, KAThompson, SADawson, GRFerris, PCastro, JL 3-phenyl-6-(2-pyridyl)methyloxy-1,2,4-triazolo[3,4-a]phthalazines and analogues: high-affinity gamma-aminobutyric acid-A benzodiazepine receptor ligands with alpha 2, alpha 3, and alpha 5-subtype binding selectivity over alpha 1. J Med Chem47:1807-22 (2004) 
 
GABA-A receptor; alpha-5/beta-3/gamma-2
Name:GABA-A receptor; alpha-5/beta-3/gamma-2
Type:n/a
Mol. Mass.:n/a
Description:ASSAY_ID of ChEMBL is 2148177
Components:This complex has 3 components.
Component 1
Name:Gamma-aminobutyric acid receptor subunit gamma-2
Synonyms:GABA(A) receptor subunit gamma-2 GBRG2_HUMAN
Type:PROTEIN
Mol. Mass.:54172.74
Organism:Homo sapiens (Human)
Description:EBI_217
Residue:467
Component 2
Name:Gamma-aminobutyric acid receptor subunit beta-3
Synonyms:GABA A receptor alpha-4/beta-3/gamma-2 GABA-A receptor GBRB3_HUMAN | agonist GABA site
Type:PROTEIN
Mol. Mass.:54130.51
Organism:Homo sapiens (Human)
Description:ChEMBL_448071
Residue:473
Component 3
Name:Gamma-aminobutyric acid receptor subunit alpha-5
Synonyms:GABA receptor alpha-5 subunit GABRA5 Gamma-aminobutyric acid receptor subunit alpha-5 (GABA(A)) | Gamma-aminobutyric acid receptor subunit alpha-5 (GABAA)
Type:Enzyme
Mol. Mass.:52160.59
Organism:Homo sapiens (Human)
Description:P31644
Residue:462
BDBM50143117
NameBDBM50143117
Synonyms:6-(Pyridin-2-ylmethoxy)-3-vinyl-[1,2,4]triazolo[3,4-a]phthalazine | CHEMBL299802
TypeSmall organic molecule
Emp. Form.C17H13N5O
Mol. Mass.303.318
SMILESC=Cc1nnc2c3ccccc3c(OCc3ccccn3)nn12