Reaction Details
TargetGamma-aminobutyric acid receptor subunit alpha-3/beta-3/gamma-2
LigandBDBM50143090
Substrate/Competitorn/a
Meas. Tech.ChEMBL_69792 (CHEMBL678741)
Ki 0.85±n/a nM
Citation Carling, RWMoore, KWStreet, LJWild, DIsted, CLeeson, PDThomas, SO'Connor, DMcKernan, RMQuirk, KCook, SMAtack, JRWafford, KAThompson, SADawson, GRFerris, PCastro, JL 3-phenyl-6-(2-pyridyl)methyloxy-1,2,4-triazolo[3,4-a]phthalazines and analogues: high-affinity gamma-aminobutyric acid-A benzodiazepine receptor ligands with alpha 2, alpha 3, and alpha 5-subtype binding selectivity over alpha 1. J Med Chem47:1807-22 (2004) 
 
Gamma-aminobutyric acid receptor subunit alpha-3/beta-3/gamma-2
Name:Gamma-aminobutyric acid receptor subunit alpha-3/beta-3/gamma-2
Type:n/a
Mol. Mass.:n/a
Description:ASSAY_ID of EBI is 68410
Components:This complex has 3 components.
Component 1
Name:Gamma-aminobutyric acid receptor subunit gamma-2
Synonyms:GABA(A) receptor subunit gamma-2 GBRG2_HUMAN
Type:PROTEIN
Mol. Mass.:54172.74
Organism:Homo sapiens (Human)
Description:EBI_217
Residue:467
Component 2
Name:Gamma-aminobutyric acid receptor subunit beta-3
Synonyms:GABA A receptor alpha-4/beta-3/gamma-2 GABA-A receptor GBRB3_HUMAN | agonist GABA site
Type:PROTEIN
Mol. Mass.:54130.51
Organism:Homo sapiens (Human)
Description:ChEMBL_448071
Residue:473
Component 3
Name:Gamma-aminobutyric acid receptor subunit alpha-3
Synonyms:GABA A Alpha3Beta3Gamma2 GABA C GABA-A receptor GBRA3_HUMAN agonist GABA site
Type:Enzyme Catalytic Domain
Mol. Mass.:55175.47
Organism:Homo sapiens (Human)
Description:GABA A Alpha3Beta1Gamma2 0 HUMAN::P34903
Residue:492
BDBM50143090
NameBDBM50143090
Synonyms:3-Phenyl-6-(pyridin-2-ylmethoxy)-7,8,9,10-tetrahydro-[1,2,4]triazolo[3,4-a]phthalazine | CHEMBL53238
TypeSmall organic molecule
Emp. Form.C21H19N5O
Mol. Mass.357.4085
SMILESC(Oc1nn2c(nnc2c2CCCCc12)-c1ccccc1)c1ccccn1