Reaction Details
TargetNociceptin receptor
LigandBDBM50143267
Substrate/Competitorn/a
Meas. Tech.ChEMBL_146115 (CHEMBL754584)
Ki 27±n/a nM
Citation Van Cauwenberghe, SSimonin, FCluzeau, JBecker, JALubell, WDTourwé, D Structure-activity study of the ORL1 antagonist Ac-Arg-D-Cha-Qaa-D-Arg-D-p-ClPhe-NH2. J Med Chem47:1864-7 (2004) 
 
Nociceptin receptor
Name:Nociceptin receptor
Type:G Protein-Coupled Receptor (GPCR)
Mol. Mass.:40702.87
Organism:Homo sapiens (Human)
Description:P41146
Residue:370
BDBM50143267
NameBDBM50143267
Synonyms:7-[(R)-2-((S)-2-Acetylamino-5-guanidino-pentanoylamino)-3-cyclohexyl-propionylamino]-6-oxo-octahydro-quinolizine-4-carboxylic acid {(R)-1-[1-carbamoyl-2-((R)-4-chloro-phenyl)-ethylcarbamoyl]-4-guanidino-butyl}-amide | CHEMBL3144469
TypeSmall organic molecule
Emp. Form.C42H66ClN13O7
Mol. Mass.900.509
SMILES[H][C@]12[#6]-[#6]-[#6]-[#6@H](-[#7]1-[#6](=O)-[#6@H](-[#6]-[#6]2)-[#7]-[#6](=O)-[#6@@H](-[#6]-[#6]-1-[#6]-[#6]-[#6]-[#6]-[#6]-1)-[#7]-[#6](=O)-[#6@H](-[#6]-[#6]-[#6]\[#7]=[#6](\[#7])-[#7])-[#7]-[#6](-[#6])=O)-[#6](=O)-[#7]-[#6@H](-[#6]-[#6]-[#6]\[#7]=[#6](\[#7])-[#7])-[#6](=O)-[#7]-[#6@H](-[#6]-c1ccc(Cl)cc1)-[#6](-[#7])=O