Reaction Details
TargetKappa-type opioid receptor
LigandBDBM50143269
Substrate/Competitorn/a
Meas. Tech.ChEMBL_145240 (CHEMBL755691)
Ki>5000±n/a nM
Citation Van Cauwenberghe, SSimonin, FCluzeau, JBecker, JALubell, WDTourwé, D Structure-activity study of the ORL1 antagonist Ac-Arg-D-Cha-Qaa-D-Arg-D-p-ClPhe-NH2. J Med Chem47:1864-7 (2004) 
 
Kappa-type opioid receptor
Name:Kappa-type opioid receptor
Type:G Protein-Coupled Receptor (GPCR)
Mol. Mass.:42648.76
Organism:Homo sapiens (Human)
Description:P41145
Residue:380
BDBM50143269
NameBDBM50143269
Synonyms:7-[2-((S)-2-Acetylamino-5-(R)-guanidino-pentanoylamino)-3-cyclohexyl-propionylamino]-6-oxo-octahydro-quinolizine-4-carboxylic acid ((R)-1-carbamoyl-4-ureido-butyl)-amide | CHEMBL3144464
TypeSmall organic molecule
Emp. Form.C33H57N11O7
Mol. Mass.719.8752
SMILES[H][C@]12[#6]-[#6]-[#6]-[#6@H](-[#7]1-[#6](=O)-[#6@H](-[#6]-[#6]2)-[#7]-[#6](=O)-[#6@@H](-[#6]-[#6]-1-[#6]-[#6]-[#6]-[#6]-[#6]-1)-[#7]-[#6](=O)-[#6@H](-[#6]-[#6]-[#6]\[#7]=[#6](\[#7])-[#7])-[#7]-[#6](-[#6])=O)-[#6](=O)-[#7]-[#6@H](-[#6]-[#6]-[#6]-[#7]-[#6](-[#7])=O)-[#6](-[#7])=O