Reaction Details
TargetKappa-type opioid receptor
LigandBDBM50143266
Substrate/Competitorn/a
Meas. Tech.ChEMBL_145240 (CHEMBL755691)
Ki 153±n/a nM
Citation Van Cauwenberghe, SSimonin, FCluzeau, JBecker, JALubell, WDTourwé, D Structure-activity study of the ORL1 antagonist Ac-Arg-D-Cha-Qaa-D-Arg-D-p-ClPhe-NH2. J Med Chem47:1864-7 (2004) 
 
Kappa-type opioid receptor
Name:Kappa-type opioid receptor
Type:G Protein-Coupled Receptor (GPCR)
Mol. Mass.:42648.76
Organism:Homo sapiens (Human)
Description:P41145
Residue:380
BDBM50143266
NameBDBM50143266
Synonyms:7-[(R)-2-((S)-2-Acetylamino-5-ureido-pentanoylamino)-3-cyclohexyl-propionylamino]-6-oxo-octahydro-quinolizine-4-carboxylic acid {(R)-1-[1-carbamoyl-2-((R)-4-chloro-phenyl)-ethylcarbamoyl]-4-guanidino-butyl}-amide | CHEMBL3144465
TypeSmall organic molecule
Emp. Form.C40H62ClN11O7
Mol. Mass.844.443
SMILES[H][C@]12CCC[C@H](N1C(=O)[C@H](CC2)NC(=O)[C@@H](CC1CCCCC1)NC(=O)CCCCNC(N)=N)C(=O)N[C@H](CCCNC(N)=O)C(=O)N[C@H](Cc1ccc(Cl)cc1)C(N)=O