Reaction Details
TargetKappa-type opioid receptor
LigandBDBM50143272
Substrate/Competitorn/a
Meas. Tech.ChEMBL_148096 (CHEMBL751578)
Ki 78.0±n/a nM
Citation Van Cauwenberghe, SSimonin, FCluzeau, JBecker, JALubell, WDTourwé, D Structure-activity study of the ORL1 antagonist Ac-Arg-D-Cha-Qaa-D-Arg-D-p-ClPhe-NH2. J Med Chem47:1864-7 (2004) 
 
Kappa-type opioid receptor
Name:Kappa-type opioid receptor
Type:G Protein-Coupled Receptor (GPCR)
Mol. Mass.:42648.76
Organism:Homo sapiens (Human)
Description:P41145
Residue:380
BDBM50143272
NameBDBM50143272
Synonyms:6-[2-((2S,3R)-2-Acetylamino-5-guanidino-pentanoylamino)-3-cyclohexyl-propionylamino]-5-oxo-hexahydro-thiazolo[3,2-a]pyridine-3-carboxylic acid {(R)-1-[1-carbamoyl-2-(4-chloro-phenyl)-ethylcarbamoyl]-4-guanidino-butyl}-amide | CHEMBL3144471
TypeSmall organic molecule
Emp. Form.C40H62ClN13O7S
Mol. Mass.904.521
SMILES[H][C@]12[#6]-[#6]-[#6@H](-[#7]-[#6](=O)-[#6@@H](-[#6]-[#6]-3-[#6]-[#6]-[#6]-[#6]-[#6]-3)-[#7]-[#6](=O)-[#6@H](-[#6]-[#6]-[#6]\[#7]=[#6](\[#7])-[#7])-[#7]-[#6](-[#6])=O)-[#6](=O)-[#7]1-[#6@@H](-[#6]-[#16]2)-[#6](=O)-[#7]-[#6@H](-[#6]-[#6]-[#6]\[#7]=[#6](\[#7])-[#7])-[#6](=O)-[#7]-[#6](-[#6]-c1ccc(Cl)cc1)-[#6](-[#7])=O