Reaction Details
TargetDelta-type opioid receptor
LigandBDBM50143266
Substrate/Competitorn/a
Meas. Tech.ChEMBL_148096 (CHEMBL751578)
Ki 85±n/a nM
Citation Van Cauwenberghe, SSimonin, FCluzeau, JBecker, JALubell, WDTourwé, D Structure-activity study of the ORL1 antagonist Ac-Arg-D-Cha-Qaa-D-Arg-D-p-ClPhe-NH2. J Med Chem47:1864-7 (2004) 
 
Delta-type opioid receptor
Name:Delta-type opioid receptor
Type:G Protein-Coupled Receptor (GPCR)
Mol. Mass.:40382.98
Organism:Homo sapiens (Human)
Description:Competition binding assays were carried out using membrane preparations from transfected HN9.10 cells that constitutively expressed the delta opioid receptor.
Residue:372
BDBM50143266
NameBDBM50143266
Synonyms:7-[(R)-2-((S)-2-Acetylamino-5-ureido-pentanoylamino)-3-cyclohexyl-propionylamino]-6-oxo-octahydro-quinolizine-4-carboxylic acid {(R)-1-[1-carbamoyl-2-((R)-4-chloro-phenyl)-ethylcarbamoyl]-4-guanidino-butyl}-amide | CHEMBL3144465
TypeSmall organic molecule
Emp. Form.C40H62ClN11O7
Mol. Mass.844.443
SMILES[H][C@]12CCC[C@H](N1C(=O)[C@H](CC2)NC(=O)[C@@H](CC1CCCCC1)NC(=O)CCCCNC(N)=N)C(=O)N[C@H](CCCNC(N)=O)C(=O)N[C@H](Cc1ccc(Cl)cc1)C(N)=O