Reaction Details
TargetKappa-type opioid receptor
LigandBDBM50143268
Substrate/Competitorn/a
Meas. Tech.ChEMBL_145240 (CHEMBL755691)
Ki 779±n/a nM
Citation Van Cauwenberghe, SSimonin, FCluzeau, JBecker, JALubell, WDTourwé, D Structure-activity study of the ORL1 antagonist Ac-Arg-D-Cha-Qaa-D-Arg-D-p-ClPhe-NH2. J Med Chem47:1864-7 (2004) 
 
Kappa-type opioid receptor
Name:Kappa-type opioid receptor
Type:G Protein-Coupled Receptor (GPCR)
Mol. Mass.:42648.76
Organism:Homo sapiens (Human)
Description:P41145
Residue:380
BDBM50143268
NameBDBM50143268
Synonyms:7-[(S)-2-((R)-Acetylamino)-5-guanidino-pentanoylamino]-6-oxo-octahydro-quinolizine-4-carboxylic acid {(R)-1-[1-carbamoyl-2-((R)-4-chloro-phenyl)-ethylcarbamoyl]-4-ureido-butyl}-amide | CHEMBL3144467
TypeSmall organic molecule
Emp. Form.C33H50ClN11O7
Mol. Mass.748.273
SMILES[H][C@]12[#6]-[#6]-[#6]-[#6@H](-[#7]1-[#6](=O)-[#6@H](-[#6]-[#6]2)-[#7]-[#6](=O)-[#6@H](-[#6]-[#6]-[#6]\[#7]=[#6](\[#7])-[#7])-[#7]-[#6](-[#6])=O)-[#6](=O)-[#7]-[#6@H](-[#6]-[#6]-[#6]-[#7]-[#6](-[#7])=O)-[#6](=O)-[#7]-[#6@H](-[#6]-c1ccc(Cl)cc1)-[#6](-[#7])=O