Reaction Details
TargetSodium- and chloride-dependent creatine transporter 1
LigandBDBM50143296
Substrate/Competitorn/a
Meas. Tech.ChEBML_49276
Ki 250000±n/a nM
Citation Crooks, PAAyers, JTXu, RSumithran, SPGrinevich, VPWilkins, LHDeaciuc, AGAllen, DDDwoskin, LP Development of subtype-selective ligands as antagonists at nicotinic receptors mediating nicotine-evoked dopamine release. Bioorg Med Chem Lett14:1869-74 (2004) 
 
Sodium- and chloride-dependent creatine transporter 1
Name:Sodium- and chloride-dependent creatine transporter 1
Type:PROTEIN
Mol. Mass.:70632.63
Organism:Rattus norvegicus
Description:ChEMBL_49276
Residue:635
BDBM50143296
NameBDBM50143296
Synonyms:1-Butyl-pyridinium | CHEMBL443525
TypeSmall organic molecule
Emp. Form.C9H14N
Mol. Mass.136.2136
SMILESCCCC[n+]1ccccc1