Reaction Details
TargetNeuronal acetylcholine receptor subunit alpha-7
LigandBDBM50119640
Substrate/Competitorn/a
Meas. Tech.ChEBML_144185
Ki 3.4±n/a nM
Citation Carroll, FI Epibatidine structure-activity relationships. Bioorg Med Chem Lett14:1889-96 (2004) 
 
Neuronal acetylcholine receptor subunit alpha-7
Name:Neuronal acetylcholine receptor subunit alpha-7
Type:Enzyme
Mol. Mass.:56502.44
Organism:Rattus norvegicus (Rat)
Description:Q05941
Residue:502
BDBM50119640
NameBDBM50119640
Synonyms:2-(6-Chloro-5-fluoro-pyridin-3-yl)-7-aza-bicyclo[2.2.1]heptane | CHEMBL54686
TypeSmall organic molecule
Emp. Form.C11H12ClFN2
Mol. Mass.226.678
SMILESFc1cc(cnc1Cl)[C@H]1CC2CCC1N2