Reaction Details
TargetNeuronal acetylcholine receptor subunit alpha-7
LigandBDBM50143314
Substrate/Competitorn/a
Meas. Tech.ChEMBL_144185 (CHEMBL749306)
Ki 198±n/a nM
Citation Carroll, FI Epibatidine structure-activity relationships. Bioorg Med Chem Lett14:1889-96 (2004) 
 
Neuronal acetylcholine receptor subunit alpha-7
Name:Neuronal acetylcholine receptor subunit alpha-7
Type:Enzyme
Mol. Mass.:56502.44
Organism:Rattus norvegicus (Rat)
Description:Q05941
Residue:502
BDBM50143314
NameBDBM50143314
Synonyms:(+)-Epibatidine (1R,2R,4S)-2-(6-Chloro-pyridin-3-yl)-7-aza-bicyclo[2.2.1]heptane CHEMBL298826 | EPIBATIDINE
TypeSmall organic molecule
Emp. Form.C11H13ClN2
Mol. Mass.208.687
SMILESClc1ccc(cn1)[C@H]1C[C@@H]2CC[C@H]1N2