Reaction Details
TargetNeuronal acetylcholine receptor subunit alpha-2/beta-2
LigandBDBM50100708
Substrate/Competitorn/a
Meas. Tech.ChEMBL_143226 (CHEMBL750087)
Ki>10.00±n/a nM
Citation Carroll, FI Epibatidine structure-activity relationships. Bioorg Med Chem Lett14:1889-96 (2004) 
 
Neuronal acetylcholine receptor subunit alpha-2/beta-2
Name:Neuronal acetylcholine receptor subunit alpha-2/beta-2
Type:n/a
Mol. Mass.:n/a
Description:ASSAY_ID of EBI is 143226
Components:This complex has 2 components.
Component 1
Name:Neuronal acetylcholine receptor subunit alpha-2
Synonyms:ACHA2_RAT Cholinergic, Nicotinic Alpha2Beta2 Chrna2
Type:Enzyme
Mol. Mass.:58597.25
Organism:Rattus norvegicus (Rat)
Description:P12389
Residue:511
Component 2
Name:Neuronal acetylcholine receptor subunit beta-2
Synonyms:ACHB2_RAT Chrnb2 Neuronal acetylcholine receptor non-alpha-1 chain
Type:Enzyme
Mol. Mass.:56910.32
Organism:Rattus norvegicus (Rat)
Description:P12390
Residue:500
BDBM50100708
NameBDBM50100708
Synonyms:5-(7-Aza-bicyclo[2.2.1]hept-2-yl)-pyridine-2-sulfonic acid trifluoromethyl ester | CHEMBL300837
TypeSmall organic molecule
Emp. Form.C12H13F3N2O3S
Mol. Mass.322.303
SMILESFC(F)(F)OS(=O)(=O)c1ccc(cn1)C1CC2CCC1N2