Reaction Details
TargetVitamin D3 receptor
LigandBDBM50409927
Substrate/Competitorn/a
Meas. Tech.ChEMBL_214322 (CHEMBL818350)
EC50 0.35±n/a nM
Citation Tocchini-Valentini, GRochel, NWurtz, JMMoras, D Crystal structures of the vitamin D nuclear receptor liganded with the vitamin D side chain analogues calcipotriol and seocalcitol, receptor agonists of clinical importance. Insights into a structural basis for the switching of calcipotriol to a receptor antagonist by further side chain modificatio J Med Chem47:1956-61 (2004) 
 
Vitamin D3 receptor
Name:Vitamin D3 receptor
Type:Protein
Mol. Mass.:48288.72
Organism:Homo sapiens (Human)
Description:P11473
Residue:427
BDBM50409927
NameBDBM50409927
Synonyms:CHEMBL2112315
TypeSmall organic molecule
Emp. Form.C32H46O5
Mol. Mass.510.7046
SMILESCCOC(=O)\C=C\C1(CC1)[C@H](O)\C=C\[C@@H](C)[C@H]1CC[C@H]2\C(CCC[C@]12C)=C\C=C1\C[C@@H](O)C[C@H](O)C1=C