Reaction Details
TargetMu-type opioid receptor
LigandBDBM50144235
Substrate/Competitorn/a
Meas. Tech.ChEBML_149323
Ki 104±n/a nM
Citation Carson, JRCoats, SJCodd, EEDax, SLLee, JMartinez, RPNeilson, LAPitis, PMZhang, SP N,N-dialkyl-4-[(8-azabicyclo[3.2.1]-oct-3-ylidene)phenylmethyl]benzamides, potent, selective delta opioid agonists. Bioorg Med Chem Lett14:2109-12 (2004) 
 
Mu-type opioid receptor
Name:Mu-type opioid receptor
Type:G Protein-Coupled Receptor (GPCR)
Mol. Mass.:44789.51
Organism:Homo sapiens (Human)
Description:P35372
Residue:400
BDBM50144235
NameBDBM50144235
Synonyms:CHEMBL63750 | N,N-Diethyl-4-{phenyl-[8-(3-phenyl-propyl)-8-aza-bicyclo[3.2.1]oct-3-ylidene]-methyl}-benzamide
TypeSmall organic molecule
Emp. Form.C34H40N2O
Mol. Mass.492.6942
SMILES[#6]-[#6]-[#7](-[#6]-[#6])-[#6](=O)-c1ccc(cc1)-[#6](=[#6]-1\[#6]-[#6]-2-[#6]-[#6]-[#6](-[#6]-1)-[#7]-2-[#6]-[#6]-[#6]-c1ccccc1)\c1ccccc1