Reaction Details
TargetDelta-type opioid receptor
LigandBDBM50144266
Substrate/Competitorn/a
Meas. Tech.ChEBML_147341
Ki 0.860000±n/a nM
Citation Carson, JRCoats, SJCodd, EEDax, SLLee, JMartinez, RPMcKown, LAAnne Neilson, LPitis, PMWu, WNZhang, SP N-alkyl-4-[(8-azabicyclo[3.2.1]-oct-3-ylidene)phenylmethyl]benzamides, micro and delta opioid agonists: a micro address. Bioorg Med Chem Lett14:2113-6 (2004) 
 
Delta-type opioid receptor
Name:Delta-type opioid receptor
Type:G Protein-Coupled Receptor (GPCR)
Mol. Mass.:40382.98
Organism:Homo sapiens (Human)
Description:Competition binding assays were carried out using membrane preparations from transfected HN9.10 cells that constitutively expressed the delta opioid receptor.
Residue:372
BDBM50144266
NameBDBM50144266
Synonyms:CHEMBL291357 | N-Ethyl-4-[phenyl-(8-pyridin-2-ylmethyl-8-aza-bicyclo[3.2.1]oct-3-ylidene)-methyl]-benzamide
TypeSmall organic molecule
Emp. Form.C29H31N3O
Mol. Mass.437.5759
SMILES[#6]-[#6]-[#7]-[#6](=O)-c1ccc(cc1)-[#6](=[#6]-1/[#6]-[#6]-2-[#6]-[#6]-[#6](-[#6]-1)-[#7]-2-[#6]-c1ccccn1)\c1ccccc1