Reaction Details
TargetMu-type opioid receptor
LigandBDBM50144273
Substrate/Competitorn/a
Meas. Tech.ChEBML_149324
Ki 3.8±n/a nM
Citation Carson, JRCoats, SJCodd, EEDax, SLLee, JMartinez, RPMcKown, LAAnne Neilson, LPitis, PMWu, WNZhang, SP N-alkyl-4-[(8-azabicyclo[3.2.1]-oct-3-ylidene)phenylmethyl]benzamides, micro and delta opioid agonists: a micro address. Bioorg Med Chem Lett14:2113-6 (2004) 
 
Mu-type opioid receptor
Name:Mu-type opioid receptor
Type:G Protein-Coupled Receptor (GPCR)
Mol. Mass.:44789.51
Organism:Homo sapiens (Human)
Description:P35372
Residue:400
BDBM50144273
NameBDBM50144273
Synonyms:CHEMBL66741 | N-Ethyl-4-[(3-methoxy-phenyl)-(8-thiophen-2-ylmethyl-8-aza-bicyclo[3.2.1]oct-3-ylidene)-methyl]-benzamide
TypeSmall organic molecule
Emp. Form.C29H32N2O2S
Mol. Mass.472.642
SMILES[#6]-[#6]-[#7]-[#6](=O)-c1ccc(cc1)-[#6](=[#6]-1\[#6]-[#6]-2-[#6]-[#6]-[#6](-[#6]-1)-[#7]-2-[#6]-c1cccs1)\c1cccc(-[#8]-[#6])c1