Reaction Details
TargetMu-type opioid receptor
LigandBDBM50144291
Substrate/Competitorn/a
Meas. Tech.ChEBML_149324
Ki 6.8±n/a nM
Citation Carson, JRCoats, SJCodd, EEDax, SLLee, JMartinez, RPMcKown, LAAnne Neilson, LPitis, PMWu, WNZhang, SP N-alkyl-4-[(8-azabicyclo[3.2.1]-oct-3-ylidene)phenylmethyl]benzamides, micro and delta opioid agonists: a micro address. Bioorg Med Chem Lett14:2113-6 (2004) 
 
Mu-type opioid receptor
Name:Mu-type opioid receptor
Type:G Protein-Coupled Receptor (GPCR)
Mol. Mass.:44789.51
Organism:Homo sapiens (Human)
Description:P35372
Residue:400
BDBM50144291
NameBDBM50144291
Synonyms:CHEMBL67790 | N-Ethyl-4-[(4-hydroxy-phenyl)-(8-thiophen-2-ylmethyl-8-aza-bicyclo[3.2.1]oct-3-ylidene)-methyl]-benzamide
TypeSmall organic molecule
Emp. Form.C28H30N2O2S
Mol. Mass.458.615
SMILES[#6]-[#6]-[#7]-[#6](=O)-c1ccc(cc1)-[#6](=[#6]-1/[#6]-[#6]-2-[#6]-[#6]-[#6](-[#6]-1)-[#7]-2-[#6]-c1cccs1)\c1ccc(-[#8])cc1