Reaction Details
TargetSigma non-opioid intracellular receptor 1
LigandBDBM50144512
Substrate/Competitorn/a
Meas. Tech.ChEBML_201915
Ki 0.130000±n/a nM
Citation Glennon, RAIsmaiel, AMAblordeppey, SEl-Ashmawy, MFisher, JB Thioxanthene-derived analogs as sigma(1) receptor ligands. Bioorg Med Chem Lett14:2217-20 (2004) 
 
Sigma non-opioid intracellular receptor 1
Name:Sigma non-opioid intracellular receptor 1
Type:Enzyme Catalytic Domain
Mol. Mass.:25124.85
Organism:Homo sapiens (Human)
Description:Q99720
Residue:223
BDBM50144512
NameBDBM50144512
Synonyms:1-(5,5-Diphenyl-pent-4-enyl)-4-methyl-piperidine | CHEMBL67808
TypeSmall organic molecule
Emp. Form.C23H29N
Mol. Mass.319.4831
SMILES[#6]-[#6]-1-[#6]-[#6]-[#7](-[#6]-[#6]-[#6]\[#6]=[#6](/c2ccccc2)-c2ccccc2)-[#6]-[#6]-1