Reaction Details
TargetSigma non-opioid intracellular receptor 1
LigandBDBM50144513
Substrate/Competitorn/a
Meas. Tech.ChEBML_201915
Ki 0.660000±n/a nM
Citation Glennon, RAIsmaiel, AMAblordeppey, SEl-Ashmawy, MFisher, JB Thioxanthene-derived analogs as sigma(1) receptor ligands. Bioorg Med Chem Lett14:2217-20 (2004) 
 
Sigma non-opioid intracellular receptor 1
Name:Sigma non-opioid intracellular receptor 1
Type:Enzyme Catalytic Domain
Mol. Mass.:25124.85
Organism:Homo sapiens (Human)
Description:Q99720
Residue:223
BDBM50144513
NameBDBM50144513
Synonyms:(5,5-Diphenyl-pentyl)-phenethyl-amine | CHEMBL303263
TypeSmall organic molecule
Emp. Form.C25H29N
Mol. Mass.343.5045
SMILESC(CCC(c1ccccc1)c1ccccc1)CNCCc1ccccc1