Reaction Details
TargetFibroblast growth factor 1
LigandBDBM50144521
Substrate/Competitorn/a
Meas. Tech.ChEBML_70464
Kd 32600±n/a nM
Citation Liu, LPing Li, CCochran, SFerro, V Application of the four-component Ugi condensation for the preparation of sulfated glycoconjugate libraries. Bioorg Med Chem Lett14:2221-6 (2004) 
 
Fibroblast growth factor 1
Name:Fibroblast growth factor 1
Type:Protein
Mol. Mass.:17461.01
Organism:Homo sapiens (Human)
Description:P05230
Residue:155
BDBM50144521
NameBDBM50144521
Synonyms:CHEMBL3215303 | Sodium sulfated glycoconjugate derivative
TypeSmall organic molecule
Emp. Form.C40H62N4Na6O34S6
Mol. Mass.1473.255
SMILES[Na+].[Na+].[Na+].[Na+].[Na+].[Na+].CO[C@H]1O[C@@H](COCC(=O)N(CC(=O)NC2CCCCC2)[C@H]2CC[C@@H](CC2)N(CC(=O)NC2CCCCC2)C(=O)COC[C@@H]2O[C@H](OC)[C@H](OS([O-])(=O)=O)[C@@H](OS([O-])(=O)=O)[C@@H]2OS([O-])(=O)=O)[C@@H](OS([O-])(=O)=O)[C@H](OS([O-])(=O)=O)[C@H]1OS([O-])(=O)=O