Reaction Details
TargetFibroblast growth factor 1
LigandBDBM50144524
Substrate/Competitorn/a
Meas. Tech.ChEBML_70464
Kd 10000±n/a nM
Citation Liu, LPing Li, CCochran, SFerro, V Application of the four-component Ugi condensation for the preparation of sulfated glycoconjugate libraries. Bioorg Med Chem Lett14:2221-6 (2004) 
 
Fibroblast growth factor 1
Name:Fibroblast growth factor 1
Type:Protein
Mol. Mass.:17461.01
Organism:Homo sapiens (Human)
Description:P05230
Residue:155
BDBM50144524
NameBDBM50144524
Synonyms:CHEMBL3215307 | Sodium sulfated glycoconjugate derivative
TypeSmall organic molecule
Emp. Form.C39H60N4Na8O40S8
Mol. Mass.1665.335
SMILES[Na+].[Na+].[Na+].[Na+].[Na+].[Na+].[Na+].[Na+].CC(C)(CC(=O)N(CCO[C@H]1O[C@@H](COS([O-])(=O)=O)[C@@H](OS([O-])(=O)=O)[C@H](OS([O-])(=O)=O)[C@H]1OS([O-])(=O)=O)CC(=O)NC1CCCCC1)CC(=O)N(CCO[C@H]1O[C@@H](COS([O-])(=O)=O)[C@@H](OS([O-])(=O)=O)[C@H](OS([O-])(=O)=O)[C@H]1OS([O-])(=O)=O)CC(=O)NC1CCCCC1