Reaction Details
TargetFibroblast growth factor 1
LigandBDBM50144526
Substrate/Competitorn/a
Meas. Tech.ChEBML_70464
Kd 4840±n/a nM
Citation Liu, LPing Li, CCochran, SFerro, V Application of the four-component Ugi condensation for the preparation of sulfated glycoconjugate libraries. Bioorg Med Chem Lett14:2221-6 (2004) 
 
Fibroblast growth factor 1
Name:Fibroblast growth factor 1
Type:Protein
Mol. Mass.:17461.01
Organism:Homo sapiens (Human)
Description:P05230
Residue:155
BDBM50144526
NameBDBM50144526
Synonyms:CHEMBL3215304 | Sodium sulfated glycoconjugate derivative
TypeSmall organic molecule
Emp. Form.C26H33N2Na7O35S7
Mol. Mass.1318.916
SMILES[Na+].[Na+].[Na+].[Na+].[Na+].[Na+].[Na+].CO[C@H]1O[C@@H](COCC(=O)N(CC(=O)NCCO[C@H]2O[C@@H](COS([O-])(=O)=O)[C@@H](OS([O-])(=O)=O)[C@H](OS([O-])(=O)=O)[C@H]2OS([O-])(=O)=O)Cc2ccccc2)[C@@H](OS([O-])(=O)=O)[C@H](OS([O-])(=O)=O)[C@H]1OS([O-])(=O)=O